idnr,sex,birthmonth,birthyear,m_entry,y_entry,round_entry,m_exit,y_exit,round_exit,m_death,y_death,y_fstneg,m_fstneg,d_fstneg,y_lstneg,m_lstneg,d_lstneg,y_fstpos,m_fstpos,d_fstpos,y_lstpos,m_lstpos,d_lstpos,r1district,r1site,r1hhid,r1line,r1hivrslt,r1age,r1m_round,r1y_round,r1gender,r1mborn,r1yborn,r1yrsvill,r1outside,r1edlev,r1wsect,r1wlevl,r1health,r1hivtest,r1hivtestyrs,r1agefsex,r1ptnrlife,r1ptnryear,r1condom2w,r2district,r2site,r2hhid,r2line,r2hivrslt,r2age,r2m_round,r2y_round,r2gender,r2mborn,r2yborn,r2yrsvill,r2outside,r2edlev,r2wsect,r2wlevl,r2health,r2hivtest,r2hivtestyrs,r2agefsex,r2ptnrlife,r2ptnryear,r2condom2w,r3district,r3site,r3hhid,r3line,r3hivrslt,r3age,r3m_round,r3y_round,r3gender,r3mborn,r3yborn,r3yrsvill,r3outside,r3edlev,r3wsect,r3wlevl,r3health,r3hivtest,r3hivtestyrs,r3hivself,r3tkndrugs,r3agefsex,r3ptnrlife,r3ptnryear,r3condom2w,r4district,r4site,r4hhid,r4line,r4hivrslt,r4age,r4m_round,r4y_round,r4gender,r4mborn,r4yborn,r4yrsvill,r4outside,r4edlev,r4wsect,r4wlevl,r4health,r4hivtest,r4hivtestyrs,r4hivself,r4tkndrugs,r4agefsex,r4ptnrlife,r4ptnryear,r4condom2w,r5district,r5site,r5hhid,r5line,r5hivrslt,r5age,r5m_round,r5y_round,r5gender,r5mborn,r5yborn,r5yrsvill,r5outside,r5edlev,r5wsect,r5wlevl,r5health,r5hivtest,r5hivtestyrs,r5hivself,r5tkndrugs,r5agefsex,r5ptnrlife,r5ptnryear,r5condom2w,r6district,r6site,r6hhid,r6line,r6hivrslt,r6age,r6m_round,r6y_round,r6gender,r6mborn,r6yborn,r6yrsvill,r6outside,r6edlev,r6wsect,r6wlevl,r6health,r6hivtest,r6hivtestyrs,r6hivself,r6tkndrugs,r6agefsex,r6ptnrlife,r6ptnryear,r6condom2w
4,2,7,1970,7,1998,1,11,2009,5,,,1998,7,1,2009,11,1,,,,,,,1,1,110,2,2,28,7,1998,2,7,1970,4,2,2,8,,1,2,,18,1,1,0,1,1,110,2,2,31,7,2001,2,7,1970,12,2,2,8,,1,2,,18,1,0,-8,1,1,110,2,2,33,8,2003,2,7,1970,4,2,2,8,,1,2,,,,18,1,0,0,1,1,110,2,2,36,7,2006,2,7,1970,14,2,2,6,,1,2,,,,15,1,1,0,1,,,,2,39,11,2009,2,7,1970,13,2,2,8,,1,2,,,,15,1,1,0,,,,,,,,,,,,,,,,,,,,,,,,,
6,1,11,1990,8,2006,4,11,2009,5,,,2006,8,1,2009,11,1,,,,,,,,,,,,,,,,,,,,,,,,,,,,,,,,,,,,,,,,,,,,,,,,,,,,,,,,,,,,,,,,,,,,,,,,,,,,,,1,1,110,4,2,15,8,2006,1,11,1990,4,2,1,8,,1,2,,,,,0,0,-9,1,,,,2,19,11,2009,1,11,1990,995,2,2,6,,1,2,,,,,0,0,-9,,,,,,,,,,,,,,,,,,,,,,,,,
7,1,9,1993,11,2009,5,11,2009,5,,,2009,11,1,2009,11,1,,,,,,,,,,,,,,,,,,,,,,,,,,,,,,,,,,,,,,,,,,,,,,,,,,,,,,,,,,,,,,,,,,,,,,,,,,,,,,,,,,,,,,,,,,,,,,,,,,,,,,,1,,,,2,16,11,2009,1,9,1993,995,2,1,7,,1,2,,,,,0,0,-9,,,,,,,,,,,,,,,,,,,,,,,,,
38,2,12,1950,8,2003,3,10,2009,5,,,2003,8,1,2009,10,1,,,,,,,,,,,,,,,,,,,,,,,,,,,,,,,,,,,,,,,,,,,,,,,,,,,,,1,1,113,2,2,52,8,2003,2,12,1950,995,2,0,8,,1,2,,,,15,2,0,-8,1,1,113,2,2,55,8,2006,2,,1950,40,2,0,6,,2,2,,,,16,1,0,-8,1,,,,2,58,10,2009,2,12,1950,43,2,0,8,,1,2,,,,15,1,0,-8,,,,,,,,,,,,,,,,,,,,,,,,,
57,1,2,1970,8,2006,4,10,2009,5,,,2006,8,1,2009,10,1,,,,,,,,,,,,,,,,,,,,,,,,,,,,,,,,,,,,,,,,,,,,,,,,,,,,,,,,,,,,,,,,,,,,,,,,,,,,,,1,1,116,1,2,36,8,2006,1,2,1970,995,1,1,8,,1,2,,,,17,11,1,0,1,,,,2,39,10,2009,1,2,1970,995,2,1,6,,1,1,0,2,,15,8,1,1,,,,,,,,,,,,,,,,,,,,,,,,,
58,2,5,1972,7,1998,1,11,2009,5,,,1998,7,1,2009,11,1,,,,,,,1,1,116,2,2,26,7,1998,2,5,1972,995,2,2,8,,1,2,,20,1,1,0,1,1,116,2,2,29,8,2001,2,5,1972,10,2,2,8,,1,2,,20,1,1,0,1,1,116,2,2,31,8,2003,2,5,1972,18,2,2,6,,1,2,,,,20,1,1,-8,1,1,116,2,2,34,8,2006,2,5,1972,14,2,2,8,,1,2,,,,20,1,1,0,1,,,,2,37,11,2009,2,5,1972,17,2,2,8,,2,1,1,2,,20,1,1,0,,,,,,,,,,,,,,,,,,,,,,,,,
60,1,11,1992,11,2009,5,11,2009,5,,,2009,11,1,2009,11,1,,,,,,,,,,,,,,,,,,,,,,,,,,,,,,,,,,,,,,,,,,,,,,,,,,,,,,,,,,,,,,,,,,,,,,,,,,,,,,,,,,,,,,,,,,,,,,,,,,,,,,,1,,,,2,16,11,2009,1,11,1992,995,2,2,7,,1,2,,,,,0,0,-9,,,,,,,,,,,,,,,,,,,,,,,,,
67,1,3,1985,8,2003,3,10,2009,5,,,2003,8,1,2009,10,1,,,,,,,,,,,,,,,,,,,,,,,,,,,,,,,,,,,,,,,,,,,,,,,,,,,,,1,1,117,6,2,18,8,2003,1,3,1985,995,2,1,7,,1,2,,,,,0,0,-9,1,1,117,6,2,21,9,2006,1,3,1985,995,2,2,8,,1,2,,,,,0,0,-9,1,,,,2,24,10,2009,1,3,1985,995,2,1,8,,1,2,,,,,0,0,-9,,,,,,,,,,,,,,,,,,,,,,,,,
79,1,5,1955,7,1998,1,11,2009,5,,,1998,7,1,2009,11,1,,,,,,,1,1,120,1,2,43,7,1998,1,5,1954,995,2,0,5,3,1,2,,25,10,1,0,1,1,120,1,2,46,7,2001,1,1,1955,995,2,0,9,3,1,1,3,25,5,1,0,1,1,120,1,2,48,8,2003,1,5,1955,30,2,0,5,4,1,2,,,,25,5,2,1,1,1,120,1,2,51,8,2006,1,5,1955,17,2,0,9,4,1,2,,,,20,2,1,0,1,,,,2,54,11,2009,1,1,1955,32,2,0,6,,1,2,,,,23,2,1,0,,,,,,,,,,,,,,,,,,,,,,,,,
80,2,11,1964,8,2003,3,11,2009,5,,,2003,8,1,2009,11,1,,,,,,,,,,,,,,,,,,,,,,,,,,,,,,,,,,,,,,,,,,,,,,,,,,,,,1,1,120,2,2,38,8,2003,2,11,1964,20,1,1,6,,1,2,,,,16,1,0,0,1,1,120,2,2,41,8,2006,2,11,1964,23,2,2,8,,1,2,,,,17,1,1,0,1,,,,2,44,11,2009,2,11,1964,26,2,2,8,,2,2,,,,17,1,1,0,,,,,,,,,,,,,,,,,,,,,,,,,
85,1,12,1991,11,2009,5,11,2009,5,,,2009,11,1,2009,11,1,,,,,,,,,,,,,,,,,,,,,,,,,,,,,,,,,,,,,,,,,,,,,,,,,,,,,,,,,,,,,,,,,,,,,,,,,,,,,,,,,,,,,,,,,,,,,,,,,,,,,,,1,,,,2,17,11,2009,1,12,1991,995,2,2,7,,1,2,,,,,0,0,-9,,,,,,,,,,,,,,,,,,,,,,,,,
110,1,4,1955,8,2003,3,11,2009,5,,,2003,8,1,2009,11,1,,,,,,,,,,,,,,,,,,,,,,,,,,,,,,,,,,,,,,,,,,,,,,,,,,,,,1,1,135,1,2,48,8,2003,1,4,1955,18,1,2,1,3,1,2,,,,20,8,2,0,1,1,135,1,2,51,8,2006,1,4,1955,22,2,1,1,,2,2,,,,21,7,2,0,1,,,,2,54,11,2009,1,4,1955,23,2,1,1,3,1,2,,,,21,5,2,0,,,,,,,,,,,,,,,,,,,,,,,,,
111,2,1,1957,7,1998,1,11,2009,5,,,1998,7,1,2009,11,1,,,,,,,1,1,135,2,2,41,7,1998,2,2,1957,15,1,1,8,,1,2,,18,1,1,0,,,,,,,,,,,,,,,,,,,,,,,,,,,,,,,,,,,,,,,,,,,,,,,,,,,,,,,,,,,,,,,,,,,,,,,,,,1,,,,2,52,11,2009,2,1,1957,26,2,1,8,,1,1,0,2,,18,1,1,,,,,,,,,,,,,,,,,,,,,,,,,,
134,2,11,1974,7,1998,1,11,2009,5,,,,,,,,,1998,7,1,2009,11,1,1,1,142,1,1,23,7,1998,2,8,1974,1,2,1,8,,1,2,,23,1,0,0,1,1,142,1,1,26,7,2001,2,8,1975,5,2,1,8,,1,2,,22,1,0,0,1,1,142,1,1,28,8,2003,2,11,1974,2,2,1,8,,1,2,,,,20,5,1,,1,1,142,1,1,31,8,2006,2,11,1974,7,1,1,8,,1,1,0,2,,20,3,2,-8,1,,,,1,35,11,2009,2,11,1980,995,2,1,8,,1,2,,,,20,2,0,-8,,,,,,,,,,,,,,,,,,,,,,,,,
149,1,4,1980,7,2001,2,11,2009,5,,,2001,7,1,2009,11,1,,,,,,,,,,,,,,,,,,,,,,,,,,,,,,1,1,148,4,2,21,7,2001,1,4,1980,8,2,2,1,3,1,2,,,0,0,-9,1,1,148,4,2,23,7,2003,1,4,1980,9,1,2,1,4,1,2,,,,,0,0,-9,1,1,148,4,2,26,8,2006,1,4,1980,12,1,2,1,4,1,2,,,,,0,0,-9,1,,,,2,29,11,2009,1,4,1980,7,2,2,1,3,1,1,0,2,,28,1,0,-8,,,,,,,,,,,,,,,,,,,,,,,,,
169,1,6,1966,8,2003,3,11,2009,5,,,2003,8,1,2009,11,1,,,,,,,,,,,,,,,,,,,,,,,,,,,,,,,,,,,,,,,,,,,,,,,,,,,,,1,1,152,1,2,37,8,2003,1,11,1966,7,2,2,1,3,3,2,,,,23,7,2,-8,1,1,152,1,2,40,8,2006,1,,1966,10,2,2,1,3,2,2,,,,18,7,1,,1,,,,2,43,11,2009,1,6,1970,10,2,2,1,1,1,1,0,2,,18,6,0,0,,,,,,,,,,,,,,,,,,,,,,,,,
189,1,11,1971,7,1998,1,10,2009,5,,,1998,7,1,2009,10,1,,,,,,,1,1,16,1,2,26,7,1998,1,11,1971,995,2,2,1,4,1,2,,21,9,3,0,1,1,16,1,2,29,7,2001,1,11,1971,995,2,2,1,4,1,2,,21,6,3,0,1,1,16,1,2,31,8,2003,1,11,1971,995,2,2,1,3,1,2,,,,28,2,2,-8,1,1,16,1,2,34,9,2006,1,11,1971,995,1,2,1,4,3,2,,,,21,2,2,0,1,,,,2,37,10,2009,1,11,1971,995,2,2,8,,1,2,,,,23,2,2,0,,,,,,,,,,,,,,,,,,,,,,,,,
191,1,8,1994,10,2009,5,10,2009,5,,,2009,10,1,2009,10,1,,,,,,,,,,,,,,,,,,,,,,,,,,,,,,,,,,,,,,,,,,,,,,,,,,,,,,,,,,,,,,,,,,,,,,,,,,,,,,,,,,,,,,,,,,,,,,,,,,,,,,,1,,,,2,15,10,2009,1,8,1994,995,2,1,7,,1,2,,,,,0,0,-9,,,,,,,,,,,,,,,,,,,,,,,,,
213,1,12,1972,7,1998,1,11,2009,5,,,1998,7,1,2009,11,1,,,,,,,1,1,169,1,2,25,7,1998,1,12,1971,18,2,1,8,,1,2,,18,6,4,-8,1,1,169,1,2,28,7,2001,1,12,1972,21,2,1,6,,2,2,,18,1,1,0,1,1,169,1,2,30,8,2003,1,12,1972,23,2,1,9,4,3,2,,,,19,15,1,-8,,,,,,,,,,,,,,,,,,,,,,,,,,1,,,,2,36,11,2009,1,12,1972,29,2,1,6,,1,2,,,,18,7,1,-8,,,,,,,,,,,,,,,,,,,,,,,,,
239,2,6,1950,7,1998,1,11,2009,5,,,1998,7,1,2009,11,1,,,,,,,1,1,174,2,2,48,7,1998,2,,1954,20,2,0,8,,1,2,,,1,1,0,1,1,174,2,2,51,7,2001,2,6,1950,995,2,0,8,,1,2,,19,1,1,0,1,1,174,2,2,53,8,2003,2,6,1950,40,2,0,6,,1,2,,,,18,1,0,-8,1,1,174,2,2,56,3,2007,2,,1958,,2,0,8,,1,2,,,,,1,0,-8,1,,,,2,59,11,2009,2,6,1950,40,1,0,8,,2,2,,,,20,1,1,-8,,,,,,,,,,,,,,,,,,,,,,,,,
281,1,12,1985,9,2003,3,11,2009,5,,,2003,9,1,2009,11,1,,,,,,,,,,,,,,,,,,,,,,,,,,,,,,,,,,,,,,,,,,,,,,,,,,,,,1,1,186,4,2,17,9,2003,1,12,1985,995,2,1,7,,1,2,,,,,0,0,-9,,,,,,,,,,,,,,,,,,,,,,,,,,1,,,,2,23,11,2009,1,12,1985,12,2,2,1,3,1,1,0,2,,22,1,1,0,,,,,,,,,,,,,,,,,,,,,,,,,
282,1,5,1991,11,2009,5,11,2009,5,,,2009,11,1,2009,11,1,,,,,,,,,,,,,,,,,,,,,,,,,,,,,,,,,,,,,,,,,,,,,,,,,,,,,,,,,,,,,,,,,,,,,,,,,,,,,,,,,,,,,,,,,,,,,,,,,,,,,,,1,,,,2,18,11,2009,1,5,1991,10,2,2,7,,1,,,,,,0,0,-9,,,,,,,,,,,,,,,,,,,,,,,,,
345,1,10,1962,7,1998,1,11,2009,5,,,1998,7,1,2009,11,1,,,,,,,1,1,205,1,2,35,7,1998,1,10,1962,1,2,3,4,1,1,2,,18,2,1,0,1,1,205,1,2,38,7,2001,1,10,1962,4,2,2,4,1,1,2,,28,1,0,0,1,1,205,1,2,40,9,2003,1,10,1962,6,2,3,1,1,1,2,,,,25,1,1,0,1,1,205,1,2,43,8,2006,1,10,1962,7,2,3,4,1,1,2,,,,28,1,1,0,1,,,,2,47,11,2009,1,10,1962,11,2,2,4,1,1,2,,,,27,1,1,0,,,,,,,,,,,,,,,,,,,,,,,,,
351,2,7,1963,7,2003,3,11,2009,5,,,,,,,,,2003,7,1,2009,11,1,,,,,,,,,,,,,,,,,,,,,,,,,,,,,,,,,,,,,,,,,,,,,,,1,1,208,1,1,40,7,2003,2,6,1963,9,2,2,4,1,1,2,,,,18,1,0,-8,1,1,208,1,1,43,8,2006,2,7,1984,0,1,3,9,1,1,1,1,,,20,2,1,-8,1,,,,1,46,11,2009,2,7,1963,14,2,3,4,1,2,1,0,,,20,2,0,-8,,,,,,,,,,,,,,,,,,,,,,,,,
358,2,3,1975,7,1998,1,11,2009,5,,,1998,7,1,2009,11,1,,,,,,,1,1,211,1,2,23,7,1998,2,2,1972,4,2,2,1,4,1,2,,19,3,0,-8,1,1,211,1,2,26,7,2001,2,2,1975,4,2,1,1,3,1,2,,22,3,3,-8,1,1,211,1,2,28,8,2003,2,3,1975,6,2,1,1,4,1,2,,,,18,2,1,-8,1,1,211,1,2,31,8,2006,2,3,1975,12,2,1,1,4,1,2,,,,18,6,1,-8,1,,,,2,34,11,2009,2,3,1975,16,2,1,1,4,2,1,0,2,,17,3,0,-8,,,,,,,,,,,,,,,,,,,,,,,,,
359,1,8,1992,11,2009,5,11,2009,5,,,2009,11,1,2009,11,1,,,,,,,,,,,,,,,,,,,,,,,,,,,,,,,,,,,,,,,,,,,,,,,,,,,,,,,,,,,,,,,,,,,,,,,,,,,,,,,,,,,,,,,,,,,,,,,,,,,,,,,1,,,,2,17,11,2009,1,8,1992,12,2,2,7,,1,2,,,,,0,0,-9,,,,,,,,,,,,,,,,,,,,,,,,,
378,2,8,1952,8,2003,3,11,2009,5,,,2003,8,1,2009,11,1,,,,,,,,,,,,,,,,,,,,,,,,,,,,,,,,,,,,,,,,,,,,,,,,,,,,,1,1,216,11,2,50,8,2003,2,8,1952,20,2,1,1,4,1,2,,,,16,4,3,0,1,1,216,11,2,53,8,2006,2,8,1952,20,2,0,1,4,1,2,,,,18,3,1,2,1,,,,2,57,11,2009,2,6,1956,25,2,1,8,,1,2,,,,18,2,2,-8,,,,,,,,,,,,,,,,,,,,,,,,,
390,1,5,1993,10,2009,5,10,2009,5,,,2009,10,1,2009,10,1,,,,,,,,,,,,,,,,,,,,,,,,,,,,,,,,,,,,,,,,,,,,,,,,,,,,,,,,,,,,,,,,,,,,,,,,,,,,,,,,,,,,,,,,,,,,,,,,,,,,,,,1,,,,2,16,10,2009,1,5,1993,995,2,2,7,,1,2,,,,,0,0,-9,,,,,,,,,,,,,,,,,,,,,,,,,
394,2,11,1956,7,1998,1,11,2009,5,,,1998,7,1,2009,11,1,,,,,,,1,1,217,1,2,41,7,1998,2,11,1954,1,2,1,1,4,1,2,,16,2,0,-8,1,1,217,1,2,44,7,2001,2,8,1956,5,2,1,1,4,1,2,,18,0,0,0,1,1,217,1,2,46,8,2003,2,11,1956,9,2,1,1,4,1,2,,,,18,2,0,-8,1,1,217,1,2,49,7,2006,2,11,1956,1,2,1,1,4,1,1,3,2,,20,1,0,-8,1,,,,2,52,11,2009,2,11,1956,5,2,1,1,4,1,2,,,,18,1,,-8,,,,,,,,,,,,,,,,,,,,,,,,,
397,1,8,1971,8,2003,3,10,2009,5,,,2003,8,1,2009,10,1,,,,,,,,,,,,,,,,,,,,,,,,,,,,,,,,,,,,,,,,,,,,,,,,,,,,,1,1,22,1,2,32,8,2003,1,8,1971,8,2,2,1,3,1,2,,,,18,7,1,0,1,1,22,1,2,34,7,2006,1,8,1971,11,2,2,1,1,1,2,,,,16,8,5,1,1,,,,2,38,10,2009,1,8,1971,15,2,2,1,1,1,1,4,2,,20,6,4,0,,,,,,,,,,,,,,,,,,,,,,,,,
398,2,8,1979,11,2009,5,11,2009,5,,,2009,11,1,2009,11,1,,,,,,,,,,,,,,,,,,,,,,,,,,,,,,,,,,,,,,,,,,,,,,,,,,,,,,,,,,,,,,,,,,,,,,,,,,,,,,,,,,,,,,,,,,,,,,,,,,,,,,,1,,,,2,30,11,2009,2,8,1979,12,2,1,8,,1,1,0,2,,18,1,1,0,,,,,,,,,,,,,,,,,,,,,,,,,
401,1,12,1944,7,1998,1,11,2009,5,,,1998,7,1,2009,11,1,,,,,,,1,1,221,1,2,53,7,1998,1,3,1944,25,2,0,1,4,1,2,,,0,0,-9,1,1,221,1,2,56,7,2001,1,10,1944,4,2,0,1,4,1,2,,,4,0,-8,1,1,221,1,2,58,8,2003,1,1,1949,25,2,0,1,4,1,2,,,,17,3,0,-8,1,1,221,1,2,61,7,2006,1,3,1944,,2,0,1,4,3,2,,,,,6,0,-8,1,,,,2,64,11,2009,1,12,1943,15,2,0,1,4,1,2,,,,20,1,0,-8,,,,,,,,,,,,,,,,,,,,,,,,,
417,1,12,1986,9,2006,4,10,2009,5,,,2006,9,1,2009,10,1,,,,,,,,,,,,,,,,,,,,,,,,,,,,,,,,,,,,,,,,,,,,,,,,,,,,,,,,,,,,,,,,,,,,,,,,,,,,,,1,1,227,5,2,19,9,2006,1,8,1983,995,2,1,9,3,1,2,,,,15,2,2,,1,,,,2,22,10,2009,1,12,1986,995,2,2,8,,1,2,,,,,0,0,-9,,,,,,,,,,,,,,,,,,,,,,,,,
441,2,9,1953,7,1998,1,11,2009,5,,,1998,7,1,2009,11,1,,,,,,,1,1,234,2,2,44,7,1998,2,9,1953,995,2,1,8,,1,2,,17,1,1,0,1,1,234,2,2,47,7,2001,2,10,1953,10,2,1,8,,2,2,,18,1,1,2,1,1,234,2,2,49,8,2003,2,8,1953,15,2,1,6,,1,2,,,,16,1,0,2,1,1,234,2,2,52,8,2006,2,9,1953,20,2,1,8,,1,2,,,,18,1,0,2,1,,,,2,56,11,2009,2,,1953,20,2,1,8,,1,2,,,,18,1,1,2,,,,,,,,,,,,,,,,,,,,,,,,,
443,2,4,1983,7,2001,2,11,2009,5,,,2001,7,1,2009,11,1,,,,,,,,,,,,,,,,,,,,,,,,,,,,,,1,1,234,4,2,18,7,2001,2,12,1983,10,2,2,7,,1,2,,,0,0,-9,,,,,,,,,,,,,,,,,,,,,,,,,,,,,,,,,,,,,,,,,,,,,,,,,,,1,,,,2,26,11,2009,2,4,1983,995,1,2,8,,1,1,0,2,,25,1,,-8,,,,,,,,,,,,,,,,,,,,,,,,,
465,1,2,1977,8,2005,3,10,2009,5,,,2005,8,1,2009,10,1,,,,,,,,,,,,,,,,,,,,,,,,,,,,,,,,,,,,,,,,,,,,,,,,,,,,,1,1,238,4,2,26,8,2005,1,2,1979,995,2,2,1,4,1,2,,,,15,2,1,1,1,1,238,4,2,29,9,2006,1,7,1990,995,2,2,7,,1,2,,,,,0,0,-9,1,,,,2,32,10,2009,1,2,1977,995,2,2,1,4,1,2,,,,25,1,2,0,,,,,,,,,,,,,,,,,,,,,,,,,
472,2,11,1962,7,1998,1,10,2009,5,,,1998,7,1,2009,10,1,,,,,,,1,1,239,2,2,35,7,1998,2,,1962,20,1,1,8,,2,2,,17,2,1,0,1,1,239,2,2,39,7,2001,2,,1963,23,2,1,6,,2,1,,18,2,0,,1,1,239,2,2,41,8,2003,2,,1962,995,2,1,6,,1,2,,,,20,1,0,0,1,1,239,2,2,44,9,2006,2,11,1962,27,2,1,8,,1,2,,,,16,1,1,0,1,,,,2,47,10,2009,2,7,1962,25,2,1,8,,1,1,0,2,,16,2,0,-8,,,,,,,,,,,,,,,,,,,,,,,,,
476,1,10,1961,7,1998,1,11,2009,5,,,1998,7,1,2009,11,1,,,,,,,1,1,24,1,2,36,7,1998,1,10,1961,17,2,2,1,2,1,2,,16,65,3,1,1,1,24,1,2,39,7,2001,1,10,1961,17,2,2,5,2,1,1,3,19,4,1,0,1,1,24,1,2,41,7,2003,1,10,1961,21,2,2,9,2,1,2,,,,16,53,3,0,1,1,24,1,2,44,7,2006,1,10,1961,,2,2,8,,2,2,,,,17,37,1,0,1,,,,2,48,11,2009,1,9,1961,28,2,2,9,2,1,2,,,,18,27,1,0,,,,,,,,,,,,,,,,,,,,,,,,,
488,1,12,1965,7,1998,1,11,2009,5,,,1998,7,1,2009,11,1,,,,,,,1,1,242,1,2,32,7,1998,1,12,1965,995,2,1,1,1,1,2,,15,10,3,0,1,1,242,1,2,35,7,2001,1,12,1965,22,2,2,1,4,2,2,,16,27,2,0,1,1,242,1,2,37,8,2003,1,12,1965,995,2,2,1,4,1,2,,,,19,7,2,0,1,1,242,1,2,40,8,2006,1,12,1965,26,2,1,1,4,2,2,,,,15,7,1,2,1,,,,2,43,11,2009,1,12,1965,31,2,1,8,,1,1,0,2,,21,3,1,0,,,,,,,,,,,,,,,,,,,,,,,,,
489,2,2,1965,7,1998,1,11,2009,5,,,1998,7,1,2009,11,1,,,,,,,1,1,242,2,2,33,7,1998,2,5,1965,15,2,2,6,,1,2,,22,1,1,0,1,1,242,2,2,36,7,2001,2,2,1965,15,2,2,8,,2,2,,23,1,1,0,1,1,242,2,2,38,8,2003,2,2,1986,995,2,2,8,,1,2,,,,,0,0,-9,1,1,242,2,2,41,8,2006,2,2,1965,20,2,2,8,,1,1,1,2,,21,1,0,0,1,,,,2,44,11,2009,2,2,1965,24,2,2,8,,1,1,0,2,,22,1,1,0,,,,,,,,,,,,,,,,,,,,,,,,,
491,1,4,1987,8,2003,3,11,2009,5,,,2003,8,1,2009,11,1,,,,,,,,,,,,,,,,,,,,,,,,,,,,,,,,,,,,,,,,,,,,,,,,,,,,,1,1,242,4,2,16,8,2003,1,2,1986,995,2,2,7,,1,2,,,,,0,0,-9,1,1,242,4,2,19,8,2006,1,5,1987,995,2,2,8,,1,2,,,,,0,0,-9,1,,,,2,22,11,2009,1,4,1987,995,2,2,8,,1,2,,,,22,1,1,0,,,,,,,,,,,,,,,,,,,,,,,,,
492,2,3,1992,11,2009,5,11,2009,5,,,2009,11,1,2009,11,1,,,,,,,,,,,,,,,,,,,,,,,,,,,,,,,,,,,,,,,,,,,,,,,,,,,,,,,,,,,,,,,,,,,,,,,,,,,,,,,,,,,,,,,,,,,,,,,,,,,,,,,1,,,,2,17,11,2009,2,3,1992,995,2,2,7,,2,2,,,,,0,0,-9,,,,,,,,,,,,,,,,,,,,,,,,,
493,2,3,1992,11,2009,5,11,2009,5,,,2009,11,1,2009,11,1,,,,,,,,,,,,,,,,,,,,,,,,,,,,,,,,,,,,,,,,,,,,,,,,,,,,,,,,,,,,,,,,,,,,,,,,,,,,,,,,,,,,,,,,,,,,,,,,,,,,,,,1,,,,2,17,11,2009,2,3,1992,995,2,2,7,,1,2,,,,,0,0,-9,,,,,,,,,,,,,,,,,,,,,,,,,
536,2,9,1967,7,1998,1,11,2009,5,,,1998,7,1,2003,8,1,2009,11,1,2009,11,1,1,1,249,2,2,30,7,1998,2,8,1967,11,2,2,2,4,1,2,,21,1,0,-8,1,1,249,2,2,33,8,2001,2,3,1967,5,1,2,8,,1,2,,22,1,0,-8,1,1,249,2,2,35,8,2003,2,9,1968,15,1,2,6,,2,2,,,,22,1,1,0,1,1,249,2,,39,9,2006,2,4,1966,19,1,2,8,,1,2,,,,20,1,0,-8,1,,,,1,42,11,2009,2,9,1967,22,2,2,6,,1,2,,,,20,1,0,-8,,,,,,,,,,,,,,,,,,,,,,,,,
538,2,5,1992,11,2009,5,11,2009,5,,,2009,11,1,2009,11,1,,,,,,,,,,,,,,,,,,,,,,,,,,,,,,,,,,,,,,,,,,,,,,,,,,,,,,,,,,,,,,,,,,,,,,,,,,,,,,,,,,,,,,,,,,,,,,,,,,,,,,,1,,,,2,17,11,2009,2,5,1992,995,1,2,7,,1,2,,,,,0,0,-9,,,,,,,,,,,,,,,,,,,,,,,,,
544,2,2,1965,7,1998,1,11,2009,5,,,,,,,,,1998,7,1,2009,11,1,1,1,250,1,1,33,7,1998,2,2,1966,14,2,2,6,,1,2,,18,7,1,0,1,1,250,1,1,36,7,2001,2,2,1965,14,1,2,6,,3,2,,,2,0,-8,1,1,250,1,1,38,8,2003,2,2,1965,20,2,2,8,,1,2,,,,19,2,1,-8,1,1,250,1,1,41,8,2006,2,2,1965,13,2,2,8,,1,2,,,,20,3,1,-8,1,,,,1,44,11,2009,2,2,1965,20,1,2,8,,2,2,,,,18,2,1,-8,,,,,,,,,,,,,,,,,,,,,,,,,
545,1,12,1984,8,2003,3,11,2009,5,,,2003,8,1,2009,11,1,,,,,,,,,,,,,,,,,,,,,,,,,,,,,,,,,,,,,,,,,,,,,,,,,,,,,1,1,250,2,2,18,8,2003,1,12,1984,11,1,2,8,,1,2,,,,14,10,0,0,1,1,250,2,2,21,8,2006,1,12,1984,3,2,2,8,,2,2,,,,19,2,0,-8,1,,,,2,24,11,2009,1,12,1984,995,1,2,6,,1,2,,,,17,2,0,-8,,,,,,,,,,,,,,,,,,,,,,,,,
546,2,8,1958,7,1998,1,11,2009,5,,,1998,7,1,2009,11,1,,,,,,,1,1,251,1,2,39,7,1998,2,8,1958,6,2,1,6,,2,2,,22,1,1,-8,1,1,251,1,2,42,7,2001,2,8,1958,20,2,1,8,,1,2,,16,2,0,-8,1,1,251,1,2,44,8,2003,2,8,1958,11,2,1,8,,3,2,,,,17,1,0,-8,1,1,251,1,2,48,8,2006,2,8,1958,30,2,1,8,,3,2,,,,18,1,0,-8,1,,,,2,51,11,2009,2,8,1958,17,2,1,8,,1,2,,,,19,1,,-8,,,,,,,,,,,,,,,,,,,,,,,,,
547,2,4,1992,11,2009,5,11,2009,5,,,2009,11,1,2009,11,1,,,,,,,,,,,,,,,,,,,,,,,,,,,,,,,,,,,,,,,,,,,,,,,,,,,,,,,,,,,,,,,,,,,,,,,,,,,,,,,,,,,,,,,,,,,,,,,,,,,,,,,1,,,,2,17,11,2009,2,4,1992,995,1,2,8,,1,2,,,,,0,0,-9,,,,,,,,,,,,,,,,,,,,,,,,,
550,2,4,1969,7,1998,1,11,2009,5,,,1998,7,1,2009,11,1,,,,,,,1,1,252,2,2,29,7,1998,2,4,1970,995,1,2,6,,1,2,,18,1,1,0,1,1,252,2,2,32,7,2001,2,4,1969,13,2,2,8,,1,2,,18,1,1,0,,,,,,,,,,,,,,,,,,,,,,,,,,,,,,,,,,,,,,,,,,,,,,,,,,,1,,,,2,40,11,2009,2,4,1969,21,1,2,8,,1,1,3,2,,18,1,1,-8,,,,,,,,,,,,,,,,,,,,,,,,,
553,2,2,1992,11,2009,5,11,2009,5,,,2009,11,1,2009,11,1,,,,,,,,,,,,,,,,,,,,,,,,,,,,,,,,,,,,,,,,,,,,,,,,,,,,,,,,,,,,,,,,,,,,,,,,,,,,,,,,,,,,,,,,,,,,,,,,,,,,,,,1,,,,2,17,11,2009,2,2,1992,995,2,2,7,,1,2,,,,,0,0,-9,,,,,,,,,,,,,,,,,,,,,,,,,
563,2,7,1963,7,1998,1,11,2009,5,,,,,,,,,1998,7,1,2009,11,1,1,1,254,2,1,35,7,1998,2,2,1970,13,2,0,6,,1,2,,15,1,0,-8,1,1,254,2,1,38,7,2001,2,2,1970,995,2,0,8,,1,2,,16,1,0,-8,1,1,254,2,1,40,8,2003,2,9,1963,11,2,0,8,,1,2,,,,14,1,0,-8,1,1,254,2,1,43,8,2006,2,7,1975,10,2,0,8,,1,2,,,,18,2,0,-8,1,,,,1,46,11,2009,2,7,1963,29,2,0,8,,1,2,,,,17,1,0,-8,,,,,,,,,,,,,,,,,,,,,,,,,
567,2,4,1994,11,2009,5,11,2009,5,,,2009,11,1,2009,11,1,,,,,,,,,,,,,,,,,,,,,,,,,,,,,,,,,,,,,,,,,,,,,,,,,,,,,,,,,,,,,,,,,,,,,,,,,,,,,,,,,,,,,,,,,,,,,,,,,,,,,,,1,,,,2,15,11,2009,2,4,1994,995,2,1,8,,1,2,,,,,0,0,-9,,,,,,,,,,,,,,,,,,,,,,,,,
586,2,10,1957,7,1998,1,11,2009,5,,,,,,,,,1998,7,1,2009,11,1,1,1,257,2,1,40,7,1998,2,6,1957,28,1,1,6,,1,2,,19,1,0,-8,1,1,257,2,1,43,7,2001,2,10,1957,23,2,1,8,,2,2,,20,4,1,-8,1,1,257,2,1,45,8,2003,2,10,1957,23,2,1,8,,1,2,,,,18,0,0,-8,1,1,257,2,1,48,8,2006,2,10,1958,31,1,1,8,,3,1,0,1,2,20,4,1,-8,1,,,,1,52,11,2009,2,10,1957,30,2,1,8,,2,1,4,1,1,17,2,0,-8,,,,,,,,,,,,,,,,,,,,,,,,,
588,1,5,1991,11,2009,5,11,2009,5,,,2009,11,1,2009,11,1,,,,,,,,,,,,,,,,,,,,,,,,,,,,,,,,,,,,,,,,,,,,,,,,,,,,,,,,,,,,,,,,,,,,,,,,,,,,,,,,,,,,,,,,,,,,,,,,,,,,,,,1,,,,2,18,11,2009,1,5,1991,0,1,2,7,,1,2,,,,,0,0,-9,,,,,,,,,,,,,,,,,,,,,,,,,
606,1,3,1967,8,2003,3,11,2009,5,,,2003,8,1,2009,11,1,,,,,,,,,,,,,,,,,,,,,,,,,,,,,,,,,,,,,,,,,,,,,,,,,,,,,1,1,259,3,2,36,8,2003,1,3,1967,995,2,1,1,4,1,2,,,,24,3,1,-8,1,1,259,3,2,39,8,2006,1,3,1967,995,2,2,1,3,1,2,,,,27,2,1,0,1,,,,2,42,11,2009,1,3,1967,995,2,1,1,4,1,2,,,,25,1,1,0,,,,,,,,,,,,,,,,,,,,,,,,,
610,1,8,1992,11,2009,5,11,2009,5,,,2009,11,1,2009,11,1,,,,,,,,,,,,,,,,,,,,,,,,,,,,,,,,,,,,,,,,,,,,,,,,,,,,,,,,,,,,,,,,,,,,,,,,,,,,,,,,,,,,,,,,,,,,,,,,,,,,,,,1,,,,2,17,11,2009,1,8,1992,995,2,2,7,,1,2,,,,,0,0,-9,,,,,,,,,,,,,,,,,,,,,,,,,
639,1,8,1972,9,2003,3,11,2009,5,,,2003,9,1,2006,8,1,2009,11,1,2009,11,1,,,,,,,,,,,,,,,,,,,,,,,,,,,,,,,,,,,,,,,,,,,,,,,1,1,267,1,2,30,9,2003,1,8,1972,995,2,2,6,,1,2,,,,23,1,0,-8,1,1,267,1,2,33,8,2006,1,,1972,,2,2,8,,1,2,,,,23,1,1,0,1,,,,1,37,11,2009,1,8,1970,995,2,2,6,,1,2,,,,23,1,1,2,,,,,,,,,,,,,,,,,,,,,,,,,
640,2,6,1972,7,1998,1,11,2009,5,,,,,,,,,1998,7,1,2009,11,1,1,1,267,2,1,26,7,1998,2,6,1972,4,2,1,8,,1,2,,19,2,0,0,1,1,267,2,1,29,7,2001,2,6,1972,9,1,1,8,,2,2,,18,1,0,0,1,1,267,2,1,31,8,2003,2,6,1974,8,2,1,8,,1,2,,,,16,2,0,0,1,1,267,2,1,34,8,2006,2,6,1974,14,2,1,8,,1,2,,,,18,1,0,0,1,,,,1,37,11,2009,2,6,1972,13,2,1,8,,1,1,1,1,,20,2,1,2,,,,,,,,,,,,,,,,,,,,,,,,,
643,1,3,1968,8,2003,3,10,2009,5,,,,,,,,,2003,8,1,2009,10,1,,,,,,,,,,,,,,,,,,,,,,,,,,,,,,,,,,,,,,,,,,,,,,,1,1,268,1,1,35,8,2003,1,3,1968,995,2,1,8,,1,2,,,,17,9,1,0,1,1,268,1,1,38,8,2006,1,3,1968,995,2,1,8,,1,2,,,,19,6,1,-8,1,,,,1,41,10,2009,1,3,1968,995,2,1,6,,1,2,,,,17,3,1,0,,,,,,,,,,,,,,,,,,,,,,,,,
644,2,10,1975,7,1998,1,10,2009,5,,,1998,7,1,2009,10,1,,,,,,,1,1,268,2,2,22,7,1998,2,6,1975,13,1,1,6,,1,2,,15,1,1,0,,,,,,,,,,,,,,,,,,,,,,,,1,1,268,2,2,27,8,2003,2,6,1975,14,2,1,8,,1,2,,,,16,1,1,0,1,1,268,2,2,30,8,2006,2,10,1975,17,2,1,8,,1,2,,,,14,1,1,0,1,,,,2,34,10,2009,2,10,1975,20,2,1,8,,1,1,13,,,15,1,1,0,,,,,,,,,,,,,,,,,,,,,,,,,
646,1,10,1992,10,2009,5,10,2009,5,,,2009,10,1,2009,10,1,,,,,,,,,,,,,,,,,,,,,,,,,,,,,,,,,,,,,,,,,,,,,,,,,,,,,,,,,,,,,,,,,,,,,,,,,,,,,,,,,,,,,,,,,,,,,,,,,,,,,,,1,,,,2,16,10,2009,1,10,1992,995,2,2,7,,1,2,,,,,0,0,-9,,,,,,,,,,,,,,,,,,,,,,,,,
669,2,10,1947,8,2003,3,11,2009,5,,,2003,8,1,2009,11,1,,,,,,,,,,,,,,,,,,,,,,,,,,,,,,,,,,,,,,,,,,,,,,,,,,,,,1,1,272,2,2,55,8,2003,2,,1952,35,1,2,8,,1,2,,,,25,1,0,0,1,1,272,2,2,58,8,2006,2,,1948,10,1,1,6,,2,2,,,,21,1,0,-8,1,,,,2,62,11,2009,2,10,1947,43,1,1,8,,1,2,,,,22,1,0,-8,,,,,,,,,,,,,,,,,,,,,,,,,
676,1,10,1948,7,1998,1,10,2009,5,,,1998,7,1,2009,10,1,,,,,,,1,1,274,1,2,49,7,1998,1,10,1948,20,2,1,2,2,2,2,,18,8,1,0,1,1,274,1,2,52,7,2001,1,10,1948,995,2,1,6,,2,1,3,15,4,0,0,1,1,274,1,2,54,8,2003,1,10,1948,23,2,1,6,,1,2,,,,23,8,1,0,1,1,274,1,2,57,9,2006,1,10,1948,40,2,1,6,,2,2,,,,24,2,1,0,1,,,,2,60,10,2009,1,10,1947,40,2,1,8,,1,2,,,,15,13,1,2,,,,,,,,,,,,,,,,,,,,,,,,,
677,2,6,1956,8,2003,3,10,2009,5,,,2003,8,1,2009,10,1,,,,,,,,,,,,,,,,,,,,,,,,,,,,,,,,,,,,,,,,,,,,,,,,,,,,,1,1,274,2,2,47,8,2003,2,6,1956,30,2,1,6,,3,2,,,,17,1,0,0,1,1,274,2,2,50,8,2006,2,6,1956,30,2,1,8,,2,2,,,,20,1,1,0,1,,,,2,53,10,2009,2,6,1956,35,2,1,8,,2,1,0,2,,17,1,1,1,,,,,,,,,,,,,,,,,,,,,,,,,
693,2,10,1960,8,2003,3,10,2009,5,,,2003,8,1,2009,10,1,,,,,,,,,,,,,,,,,,,,,,,,,,,,,,,,,,,,,,,,,,,,,,,,,,,,,1,1,276,1,2,42,8,2003,2,10,1960,21,2,0,8,,1,2,,,,,2,1,0,1,1,276,1,2,45,8,2006,2,10,1960,24,2,0,6,,1,2,,,,15,3,1,0,1,,,,2,48,10,2009,2,10,1960,14,2,0,8,,1,2,,,,15,1,0,-8,,,,,,,,,,,,,,,,,,,,,,,,,
705,2,7,1963,7,1998,1,10,2009,5,,,1998,7,1,2009,10,1,,,,,,,1,1,278,2,2,35,7,1998,2,7,1963,13,2,2,6,,2,2,,21,1,1,-8,1,1,278,2,2,38,7,2001,2,7,1963,17,2,2,6,,1,2,,22,1,0,-8,,,,,,,,,,,,,,,,,,,,,,,,,,1,1,278,2,2,43,9,2006,2,7,1963,23,2,2,6,,1,2,,,,19,1,0,-8,1,,,,2,46,10,2009,2,7,1963,26,2,2,8,,1,1,0,2,,19,1,0,-8,,,,,,,,,,,,,,,,,,,,,,,,,
707,1,6,1991,9,2006,4,10,2009,5,,,2006,9,1,2009,10,1,,,,,,,,,,,,,,,,,,,,,,,,,,,,,,,,,,,,,,,,,,,,,,,,,,,,,,,,,,,,,,,,,,,,,,,,,,,,,,1,1,278,4,2,15,9,2006,1,6,1991,995,2,2,8,,1,2,,,,,0,0,-9,1,,,,2,18,10,2009,1,6,1991,995,2,2,7,,1,2,,,,,0,0,-9,,,,,,,,,,,,,,,,,,,,,,,,,
727,2,3,1974,8,2003,3,10,2009,5,,,,,,,,,2003,8,1,2009,10,1,,,,,,,,,,,,,,,,,,,,,,,,,,,,,,,,,,,,,,,,,,,,,,,1,1,281,2,1,29,8,2003,2,3,1974,995,2,1,6,,1,2,,,,15,1,1,-8,1,1,281,2,1,32,9,2006,2,3,1974,995,2,1,8,,2,2,,,,18,1,1,-8,1,,,,1,35,10,2009,2,5,1974,995,2,1,8,,1,2,,,,18,1,0,-8,,,,,,,,,,,,,,,,,,,,,,,,,
728,1,1,1994,10,2009,5,10,2009,5,,,2009,10,1,2009,10,1,,,,,,,,,,,,,,,,,,,,,,,,,,,,,,,,,,,,,,,,,,,,,,,,,,,,,,,,,,,,,,,,,,,,,,,,,,,,,,,,,,,,,,,,,,,,,,,,,,,,,,,1,,,,2,15,10,2009,1,1,1994,995,2,1,8,,1,2,,,,,0,0,-9,,,,,,,,,,,,,,,,,,,,,,,,,
733,2,6,1959,11,2009,5,11,2009,5,,,2009,11,1,2009,11,1,,,,,,,,,,,,,,,,,,,,,,,,,,,,,,,,,,,,,,,,,,,,,,,,,,,,,,,,,,,,,,,,,,,,,,,,,,,,,,,,,,,,,,,,,,,,,,,,,,,,,,,1,,,,2,50,11,2009,2,6,1959,31,2,1,8,,1,2,,,,19,1,,-8,,,,,,,,,,,,,,,,,,,,,,,,,
761,2,3,1965,9,2003,3,10,2009,5,,,2003,9,1,2009,10,1,,,,,,,,,,,,,,,,,,,,,,,,,,,,,,,,,,,,,,,,,,,,,,,,,,,,,1,1,288,2,2,38,9,2003,2,11,1953,26,2,0,8,,1,2,,,,21,1,0,,1,1,288,2,2,41,9,2006,2,3,1965,29,2,1,8,,1,2,,,,20,2,0,-8,1,,,,2,44,10,2009,2,3,1965,32,2,1,8,,1,2,,,,14,1,1,0,,,,,,,,,,,,,,,,,,,,,,,,,
765,1,3,1991,9,2006,4,10,2009,5,,,2006,9,1,2009,10,1,,,,,,,,,,,,,,,,,,,,,,,,,,,,,,,,,,,,,,,,,,,,,,,,,,,,,,,,,,,,,,,,,,,,,,,,,,,,,,1,1,288,6,2,15,9,2006,1,5,1991,995,2,2,7,,2,2,,,,,0,0,-9,1,,,,2,18,10,2009,1,3,1991,995,2,2,7,,2,2,,,,,0,0,-9,,,,,,,,,,,,,,,,,,,,,,,,,
767,1,7,1957,11,2009,5,11,2009,5,,,2009,11,1,2009,11,1,,,,,,,,,,,,,,,,,,,,,,,,,,,,,,,,,,,,,,,,,,,,,,,,,,,,,,,,,,,,,,,,,,,,,,,,,,,,,,,,,,,,,,,,,,,,,,,,,,,,,,,1,,,,2,52,11,2009,1,7,1957,25,2,0,8,,1,2,,,,15,1,0,-8,,,,,,,,,,,,,,,,,,,,,,,,,